BDBM50214228 CHEMBL400067::N-(5-((R)-3-((S)-1-(3,4-dimethoxyphenyl)-3-phenylpropylamino)-2-hydroxypropyl)-2-hydroxyphenyl)methanesulfonamide
SMILES COc1ccc(cc1OC)[C@H](CCc1ccccc1)NC[C@H](O)Cc1ccc(O)c(NS(C)(=O)=O)c1
InChI Key InChIKey=MXPUBPBHIUDTJX-PKTZIBPZSA-N
Data  3 KI
  Tab Delimited (TSV)   2D SDfile   Computed 3D by Vconf -m prep SDfile
Find this compound or compounds like it in BindingDB:
Activity Spreadsheet -- Enzyme Inhibition Constant Data from BindingDB
Found 3 hits for monomerid = 50214228
TargetBeta-3 adrenergic receptor(Homo sapiens (Human))
Bristol-Myers Squibb Pharmaceutical Research Institute
Curated by ChEMBL
LigandPNGBDBM50214228(CHEMBL400067 | N-(5-((R)-3-((S)-1-(3,4-dimethoxyph...)
Affinity DataKi:  9nM. Assay description: Displacement of [125I]iodocyanopindolol from cloned human adrenergic beta-3 receptor expressed in CHO cells
In DepthDetails ArticlePubMed
TargetBeta-2 adrenergic receptor(Homo sapiens (Human))
Bristol-Myers Squibb Pharmaceutical Research Institute
Curated by ChEMBL
LigandPNGBDBM50214228(CHEMBL400067 | N-(5-((R)-3-((S)-1-(3,4-dimethoxyph...)
Affinity DataKi:  390nM. Assay description: Displacement of [125I]iodocyanopindolol from human cloned adrenergic beta-2 receptor expressed in CHO cells
In DepthDetails ArticlePubMed
TargetBeta-1 adrenergic receptor(Homo sapiens (Human))
Bristol-Myers Squibb Pharmaceutical Research Institute
Curated by ChEMBL
LigandPNGBDBM50214228(CHEMBL400067 | N-(5-((R)-3-((S)-1-(3,4-dimethoxyph...)
Affinity DataKi:  1.00E+3nM. Assay description: Displacement of [125I]iodocyanopindolol from human cloned adrenergic beta-1 receptor expressed in CHO cells
In DepthDetails ArticlePubMed