BDBM50218510 3-{4-[(benzylmethylamino)methyl]phenyl}-6-nitrochromen-2-one::CHEMBL244619
SMILES CN(Cc1ccccc1)Cc1ccc(cc1)-c1cc2cc(ccc2oc1=O)[N+]([O-])=O
InChI Key InChIKey=YOADEHMCUGVQME-UHFFFAOYSA-N
Data  2 IC50
  Tab Delimited (TSV)   2D SDfile   Computed 3D by Vconf -m prep SDfile
Find this compound or compounds like it in BindingDB:
Activity Spreadsheet -- Enzyme Inhibition Constant Data from BindingDB
Found 2 hits for monomerid = 50218510
TargetAcetylcholinesterase(Homo sapiens (Human))
University Of Bologna
Curated by ChEMBL
LigandPNGBDBM50218510(3-{4-[(benzylmethylamino)methyl]phenyl}-6-nitrochr...)
Affinity DataIC50:  148nM. Assay description: Inhibition of human recombinant AChE
In DepthDetails ArticlePubMed
TargetCholinesterase(Homo sapiens (Human))
University Of Bologna
Curated by ChEMBL
LigandPNGBDBM50218510(3-{4-[(benzylmethylamino)methyl]phenyl}-6-nitrochr...)
Affinity DataIC50: >0nM. Assay description: Inhibition of human recombinant BChE
In DepthDetails ArticlePubMed