BDBM50218642 CHEMBL39543
SMILES CC(C)(C)c1cc(-c2nc3cc(ccc3[nH]2)C(O)=O)c(O)c(c1)C(C)(C)C
InChI Key InChIKey=WWTGUMYQGRAOJP-UHFFFAOYSA-N
Data  1 IC50
  Tab Delimited (TSV)   2D SDfile   Computed 3D by Vconf -m prep SDfile
Find this compound or compounds like it in BindingDB:
Activity Spreadsheet -- Enzyme Inhibition Constant Data from BindingDB
Found 1 hit for monomerid = 50218642
TargetSporulation kinase A(Bacillus subtilis (strain 168))
The R. W. Johnson Pharmaceutical Research Institute
Curated by ChEMBL
LigandPNGBDBM50218642(CHEMBL39543)
Affinity DataIC50:  8.60E+4nM. Assay description: Inhibition of KinA/Sp0F system two component (TCS) from Bacillus subtilis.
In DepthDetails ArticlePubMed