BDBM50218649 CHEMBL417892
SMILES COc1c(cc(cc1C(C)(C)C)C(C)(C)C)-c1nc2cc(ccc2[nH]1)C(N)=N
InChI Key InChIKey=ARQGRTUNCBNPRH-UHFFFAOYSA-N
Data  1 IC50
  Tab Delimited (TSV)   2D SDfile   Computed 3D by Vconf -m prep SDfile
Find this compound or compounds like it in BindingDB:
Activity Spreadsheet -- Enzyme Inhibition Constant Data from BindingDB
Found 1 hit for monomerid = 50218649
TargetSporulation kinase A(Bacillus subtilis (strain 168))
The R. W. Johnson Pharmaceutical Research Institute
Curated by ChEMBL
LigandPNGBDBM50218649(CHEMBL417892)
Affinity DataIC50:  7.60E+4nM. Assay description: Inhibition of KinA/Sp0F system two component (TCS) from Bacillus subtilis.
In DepthDetails ArticlePubMed