BDBM50218905 2,2-diphenyl-N-(2-phenyl-2H-pyrazolo[3,4-c]quinolin-4-yl)acetamide::CHEMBL242849
SMILES O=C(Nc1nc2ccccc2c2cn(nc12)-c1ccccc1)C(c1ccccc1)c1ccccc1
InChI Key InChIKey=UWPDTDVAOYNNDB-UHFFFAOYSA-N
Data  2 KI  1 EC50
  Tab Delimited (TSV)   2D SDfile   Computed 3D by Vconf -m prep SDfile
Find this compound or compounds like it in BindingDB:
Activity Spreadsheet -- Enzyme Inhibition Constant Data from BindingDB
Found 3 hits for monomerid = 50218905
TargetAdenosine receptor A3(Homo sapiens (Human))
Università
Curated by ChEMBL
LigandPNGBDBM50218905(2,2-diphenyl-N-(2-phenyl-2H-pyrazolo[3,4-c]quinoli...)
Affinity DataKi:  8.90nM. Assay description: Displacement of [125I]AB-MECA from human adenosine A3 receptor expressed in CHO cells
In DepthDetails ArticlePubMed
TargetAdenosine receptor A1(Rattus norvegicus (rat))
Università
Curated by ChEMBL
LigandPNGBDBM50218905(2,2-diphenyl-N-(2-phenyl-2H-pyrazolo[3,4-c]quinoli...)
Affinity DataKi:  1.49E+3nM. Assay description: Displacement of [3H]DPCPX from Wistar rat adenosine A1 receptor
In DepthDetails ArticlePubMed
TargetAdenosine receptor A3(Homo sapiens (Human))
Università
Curated by ChEMBL
LigandPNGBDBM50218905(2,2-diphenyl-N-(2-phenyl-2H-pyrazolo[3,4-c]quinoli...)
Affinity DataEC50:  3.80nM. Assay description: Antagonist activity at human adenosine A3 receptor expressed in CHO cells assessed as inhibition of NECA-induced cAMP accumulation
In DepthDetails ArticlePubMed