BDBM50220970 1-[(3R,3aR)-8-methyl-3-(3-morpholin-4-yl-propyl)-3-phenyl-3a,4-dihydro-3H-5-oxa-1,9b-diaza-cyclopenta[a]naphthalen-2-yl]-ethanone::CHEMBL399378
SMILES CC(=O)C1=NN2[C@@H](COc3ccc(C)cc23)[C@@]1(CCCN1CCOCC1)c1ccccc1
InChI Key InChIKey=RUOOPFXWFLREEM-AZGAKELHSA-N
Data  2 IC50
  Tab Delimited (TSV)   2D SDfile   Computed 3D by Vconf -m prep SDfile
Find this compound or compounds like it in BindingDB:
Activity Spreadsheet -- Enzyme Inhibition Constant Data from BindingDB
Found 2 hits for monomerid = 50220970
TargetPotassium voltage-gated channel subfamily H member 2(Homo sapiens (Human))
Merck Research Laboratories
Curated by ChEMBL
LigandPNGBDBM50220970(1-[(3R,3aR)-8-methyl-3-(3-morpholin-4-yl-propyl)-3...)
Affinity DataIC50:  6.30E+3nM. Assay description: Inhibition of hERG expressed in HEK cells
In DepthDetails ArticlePubMed
TargetKinesin-like protein KIF11(Homo sapiens (Human))
Merck Research Laboratories
Curated by ChEMBL
LigandPNGBDBM50220970(1-[(3R,3aR)-8-methyl-3-(3-morpholin-4-yl-propyl)-3...)
Affinity DataIC50:  1nM. Assay description: Inhibition of kinesin spindle protein
In DepthDetails ArticlePubMed