BDBM50223887 (S)-3-(3'-{3,4-dioxo-2-[(pyridin-2-ylmethyl)-amino]-cyclobut-1-enylamino}-biphenyl-4-yl)-2-(2,4,6-trimethyl-benzenesulfonylamino)-propionic acid::CHEMBL400864
SMILES Cc1cc(C)c(c(C)c1)S(=O)(=O)N[C@@H](Cc1ccc(cc1)-c1cccc(Nc2c(NCc3ccccn3)c(=O)c2=O)c1)C(O)=O
InChI Key InChIKey=LSLKZALEBUNDHY-NDEPHWFRSA-N
Data  1 KI
  Tab Delimited (TSV)   2D SDfile   Computed 3D by Vconf -m prep SDfile
Find this compound or compounds like it in BindingDB:
Activity Spreadsheet -- Enzyme Inhibition Constant Data from BindingDB
Found 1 hit for monomerid = 50223887
TargetIntegrin alpha-V/beta-3(Homo sapiens (Human))
Bayer Healthcare
Curated by ChEMBL
LigandPNGBDBM50223887((S)-3-(3'-{3,4-dioxo-2-[(pyridin-2-ylmethyl)-amino...)
Affinity DataKi:  11nM. Assay description: Binding affinity to integrin alphavbeta3 receptor
In DepthDetails ArticlePubMed