BDBM50223896 (S)-3-[3'-(2-cyclopropylamino-3,4-dioxo-cyclobut-1-enylamino)-biphenyl-4-yl]-2-methanesulfonylamino-propionic acid::CHEMBL250190
SMILES CS(=O)(=O)N[C@@H](Cc1ccc(cc1)-c1cccc(Nc2c(NC3CC3)c(=O)c2=O)c1)C(O)=O
InChI Key InChIKey=HUVJBZOVXVKRBF-SFHVURJKSA-N
Data  1 KI
  Tab Delimited (TSV)   2D SDfile   Computed 3D by Vconf -m prep SDfile
Find this compound or compounds like it in BindingDB:
Activity Spreadsheet -- Enzyme Inhibition Constant Data from BindingDB
Found 1 hit for monomerid = 50223896
TargetIntegrin alpha-V/beta-3(Homo sapiens (Human))
Bayer Healthcare
Curated by ChEMBL
LigandPNGBDBM50223896((S)-3-[3'-(2-cyclopropylamino-3,4-dioxo-cyclobut-1...)
Affinity DataKi:  10nM. Assay description: Binding affinity to integrin alphavbeta3 receptor
In DepthDetails ArticlePubMed