BDBM50226191 2-Fluoro-Acetamide::CHEBI:53124::Monofluoroacetamide
SMILES NC(=O)CF
InChI Key InChIKey=FVTWJXMFYOXOKK-UHFFFAOYSA-N
Data  1 KI
PDB links: 2 PDB IDs match this monomer.
  Tab Delimited (TSV)   2D SDfile   Computed 3D by Vconf -m prep SDfile
Find this compound or compounds like it in BindingDB:
Activity Spreadsheet -- Enzyme Inhibition Constant Data from BindingDB
Found 1 hit for monomerid = 50226191
TargetAlcohol dehydrogenase S chain(Equus caballus)
TBA
Curated by ChEMBL
LigandPNGBDBM50226191(2-Fluoro-Acetamide | CHEBI:53124 | Monofluoroaceta...)
Affinity DataKi:  3.89E+7nM. Assay description: Inhibitory activity against horse liver alcohol dehydrogenase (ADH)
In DepthDetails ArticlePubMed