BDBM50226198 CHEMBL157192
SMILES CCOc1ccc(CC(N)=O)cc1
InChI Key InChIKey=XMZWBPRUYJYJJV-UHFFFAOYSA-N
Data  1 KI
  Tab Delimited (TSV)   2D SDfile   Computed 3D by Vconf -m prep SDfile
Find this compound or compounds like it in BindingDB:
Activity Spreadsheet -- Enzyme Inhibition Constant Data from BindingDB
Found 1 hit for monomerid = 50226198
TargetAlcohol dehydrogenase S chain(Equus caballus)
TBA
Curated by ChEMBL
LigandPNGBDBM50226198(CHEMBL157192)
Affinity DataKi:  7.94E+4nM. Assay description: Inhibitory activity against horse liver alcohol dehydrogenase (ADH)
In DepthDetails ArticlePubMed