BDBM50226203 2-Bromo-Acetamide::CHEMBL60628
SMILES NC(=O)CBr
InChI Key InChIKey=JUIKUQOUMZUFQT-UHFFFAOYSA-N
Data  1 KI
  Tab Delimited (TSV)   2D SDfile   Computed 3D by Vconf -m prep SDfile
Find this compound or compounds like it in BindingDB:
Activity Spreadsheet -- Enzyme Inhibition Constant Data from BindingDB
Found 1 hit for monomerid = 50226203
TargetAlcohol dehydrogenase S chain(Equus caballus)
TBA
Curated by ChEMBL
LigandPNGBDBM50226203(2-Bromo-Acetamide | CHEMBL60628)
Affinity DataKi:  5.75E+6nM. Assay description: Inhibitory activity against horse liver alcohol dehydrogenase (ADH)
In DepthDetails ArticlePubMed