BDBM50226476 CHEMBL27168
SMILES CCCCc1nc(Cl)c(CC(O)=O)n1Cc1cccc(c1)C(O)=O
InChI Key InChIKey=FTSAJVXUANRYBP-UHFFFAOYSA-N
Data  1 IC50
  Tab Delimited (TSV)   2D SDfile   Computed 3D by Vconf -m prep SDfile
Find this compound or compounds like it in BindingDB:
Activity Spreadsheet -- Enzyme Inhibition Constant Data from BindingDB
Found 1 hit for monomerid = 50226476
LigandPNGBDBM50226476(CHEMBL27168)
Affinity DataIC50:  1.00E+5nM. Assay description: Inhibitory concentration that gave 50 percent displacement of specific binding of [3H]AII (2 nM) to Angiotensin II receptor
In DepthDetails ArticlePubMed