BDBM50227217 CHEMBL302049
SMILES CN(C1CCCCC1)C(=O)CCCOc1ccc2N=C3N(CC(=O)N3COC(=O)C(C)(C)C)Cc2c1
InChI Key InChIKey=BHLGGZNIHLIJNR-UHFFFAOYSA-N
Data  1 IC50
  Tab Delimited (TSV)   2D SDfile   Computed 3D by Vconf -m prep SDfile
Find this compound or compounds like it in BindingDB:
Activity Spreadsheet -- Enzyme Inhibition Constant Data from BindingDB
Found 1 hit for monomerid = 50227217
TargetcAMP-specific 3',5'-cyclic phosphodiesterase 4A/4B/4C/4D(Homo sapiens (Human))
Syntex Research
Curated by ChEMBL
LigandPNGBDBM50227217(CHEMBL302049)
Affinity DataIC50:  150nM. Assay description: In vitro inhibitory activity against platelet phosphodiesterase (PDE)
In DepthDetails ArticlePubMed