BDBM50227745 2-(4-(3-((2-bromo-4-(trifluoromethyl)benzamido)methyl)phenoxy)-2-methylphenoxy)-2-methylpropanoic acid::CHEMBL236877
SMILES Cc1cc(Oc2cccc(CNC(=O)c3ccc(cc3Br)C(F)(F)F)c2)ccc1OC(C)(C)C(O)=O
InChI Key InChIKey=CTYVDIYMCVWPJJ-UHFFFAOYSA-N
Data  6 IC50  3 EC50
  Tab Delimited (TSV)   2D SDfile   Computed 3D by Vconf -m prep SDfile
Find this compound or compounds like it in BindingDB:
Activity Spreadsheet -- Enzyme Inhibition Constant Data from BindingDB
Found 9 hits for monomerid = 50227745
TargetPeroxisome proliferator-activated receptor delta(Homo sapiens (Human))
Eli Lilly
Curated by ChEMBL
LigandPNGBDBM50227745(2-(4-(3-((2-bromo-4-(trifluoromethyl)benzamido)met...)
Affinity DataEC50:  36nM. Assay description: Agonist activity at human PPARdelta expressed in CV1 cells by receptor transactivation assay
In DepthDetails ArticlePubMed
TargetPeroxisome proliferator-activated receptor delta(Homo sapiens (Human))
Eli Lilly
Curated by ChEMBL
LigandPNGBDBM50227745(2-(4-(3-((2-bromo-4-(trifluoromethyl)benzamido)met...)
Affinity DataIC50:  3nM. Assay description: Displacement of [3H]-2-(4-{2-[3-(2,4-difluoro-phenyl)-1-heptyl-ureido]-ethyl}-phenoxy)-2-methyl-butyric acid from human PPARdelta
In DepthDetails ArticlePubMed
TargetPeroxisome proliferator-activated receptor alpha(Homo sapiens (Human))
Eli Lilly
Curated by ChEMBL
LigandPNGBDBM50227745(2-(4-(3-((2-bromo-4-(trifluoromethyl)benzamido)met...)
Affinity DataEC50:  590nM. Assay description: Agonist activity at human PPARalpha expressed in CV1 cells by receptor transactivation assay
In DepthDetails ArticlePubMed
TargetPeroxisome proliferator-activated receptor alpha(Homo sapiens (Human))
Eli Lilly
Curated by ChEMBL
LigandPNGBDBM50227745(2-(4-(3-((2-bromo-4-(trifluoromethyl)benzamido)met...)
Affinity DataIC50:  1.59E+3nM. Assay description: Displacement of [3H]-2-(4-{2-[3-(2,4-difluoro-phenyl)-1-heptyl-ureido]-ethyl}-phenoxy)-2-methyl-butyric acid from human PPARalpha
In DepthDetails ArticlePubMed
TargetPeroxisome proliferator-activated receptor gamma(Homo sapiens (Human))
Universidad Nacional Aut£Noma De M£Xico
Curated by ChEMBL
LigandPNGBDBM50227745(2-(4-(3-((2-bromo-4-(trifluoromethyl)benzamido)met...)
Affinity DataIC50:  12.0nM. Assay description: Agonist activity at PPARgamma
In DepthDetails ArticlePubMed
TargetPeroxisome proliferator-activated receptor gamma(Homo sapiens (Human))
Universidad Nacional Aut£Noma De M£Xico
Curated by ChEMBL
LigandPNGBDBM50227745(2-(4-(3-((2-bromo-4-(trifluoromethyl)benzamido)met...)
Affinity DataIC50:  12nM. Assay description: Displacement of [3H]-2-methyl-2-(4-{3-{propyl-(5-pyridin-2-yl-thiophene-2-sulfonyl)-amino}-propyl}-phenoxy)-propionic acid from human PPARgamma
In DepthDetails ArticlePubMed
TargetPeroxisome proliferator-activated receptor alpha(Homo sapiens (Human))
Eli Lilly
Curated by ChEMBL
LigandPNGBDBM50227745(2-(4-(3-((2-bromo-4-(trifluoromethyl)benzamido)met...)
Affinity DataIC50:  1.59E+3nM. Assay description: Agonist activity at PPARalpha
In DepthDetails ArticlePubMed
TargetPeroxisome proliferator-activated receptor delta(Homo sapiens (Human))
Eli Lilly
Curated by ChEMBL
LigandPNGBDBM50227745(2-(4-(3-((2-bromo-4-(trifluoromethyl)benzamido)met...)
Affinity DataIC50:  3nM. Assay description: Agonist activity at PPARdelta
In DepthDetails ArticlePubMed
TargetPeroxisome proliferator-activated receptor gamma(Homo sapiens (Human))
Universidad Nacional Aut£Noma De M£Xico
Curated by ChEMBL
LigandPNGBDBM50227745(2-(4-(3-((2-bromo-4-(trifluoromethyl)benzamido)met...)
Affinity DataEC50:  43nM. Assay description: Agonist activity at human PPARgamma expressed in CV1 cells by receptor transactivation assay
In DepthDetails ArticlePubMed