BDBM50227788 CHEMBL1743936
SMILES Cl.CN(C)CCCOc1ccccc1CCc1ccc(cc1)N(C)C
InChI Key InChIKey=CYLAYWLVYLDOBG-UHFFFAOYSA-N
Data  1 KI  1 IC50
  Tab Delimited (TSV)   2D SDfile   Computed 3D by Vconf -m prep SDfile
Find this compound or compounds like it in BindingDB:
Activity Spreadsheet -- Enzyme Inhibition Constant Data from BindingDB
Found 2 hits for monomerid = 50227788
TargetSerotonin 2 (5-HT2) receptor(RAT)
Mitsubishi Kasei
Curated by ChEMBL
LigandPNGBDBM50227788(CHEMBL1743936)
Affinity DataKi:  23nM. Assay description: Inhibition of 5-hydroxytryptamine 2 induced vasoconstriction of rat caudal artery.
In DepthDetails ArticlePubMed
TargetSerotonin 2 (5-HT2) receptor(RAT)
Mitsubishi Kasei
Curated by ChEMBL
LigandPNGBDBM50227788(CHEMBL1743936)
Affinity DataIC50:  54nM. Assay description: Antagonistic activity against 5-hydroxytryptamine 2 receptor on rat frontal cortex membrane.
In DepthDetails ArticlePubMed