BDBM50228052 CHEMBL52982
SMILES CN(C)CCCCOc1cccc(CCc2ccccc2)c1
InChI Key InChIKey=WEHJYXIXWDORRL-UHFFFAOYSA-N
Data  1 KI  1 IC50
  Tab Delimited (TSV)   2D SDfile   Computed 3D by Vconf -m prep SDfile
Find this compound or compounds like it in BindingDB:
Activity Spreadsheet -- Enzyme Inhibition Constant Data from BindingDB
Found 2 hits for monomerid = 50228052
TargetSerotonin 2 (5-HT2) receptor(RAT)
Mitsubishi Kasei
Curated by ChEMBL
LigandPNGBDBM50228052(CHEMBL52982)
Affinity DataKi:  517nM. Assay description: Inhibition of 5-hydroxytryptamine 2 induced vasoconstriction of rat caudal artery.
In DepthDetails ArticlePubMed
TargetSerotonin 2 (5-HT2) receptor(RAT)
Mitsubishi Kasei
Curated by ChEMBL
LigandPNGBDBM50228052(CHEMBL52982)
Affinity DataIC50:  3.33E+3nM. Assay description: Antagonistic activity against 5-hydroxytryptamine 2 receptor on rat frontal cortex membrane.
In DepthDetails ArticlePubMed