BDBM50228189 CHEMBL52710
SMILES CN(C)CCCCOc1ccc(CCc2ccccc2)cc1
InChI Key InChIKey=JIDGDRFDNCFEEH-UHFFFAOYSA-N
Data  1 KI  1 IC50
  Tab Delimited (TSV)   2D SDfile   Computed 3D by Vconf -m prep SDfile
Find this compound or compounds like it in BindingDB:
Activity Spreadsheet -- Enzyme Inhibition Constant Data from BindingDB
Found 2 hits for monomerid = 50228189
TargetSerotonin 2 (5-HT2) receptor(RAT)
Mitsubishi Kasei
Curated by ChEMBL
LigandPNGBDBM50228189(CHEMBL52710)
Affinity DataKi:  416nM. Assay description: Inhibition of 5-hydroxytryptamine 2 induced vasoconstriction of rat caudal artery.
In DepthDetails ArticlePubMed
TargetSerotonin 2 (5-HT2) receptor(RAT)
Mitsubishi Kasei
Curated by ChEMBL
LigandPNGBDBM50228189(CHEMBL52710)
Affinity DataIC50:  1.98E+3nM. Assay description: Antagonistic activity against 5-hydroxytryptamine 2 receptor on rat frontal cortex membrane.
In DepthDetails ArticlePubMed