BDBM50228247 CHEMBL38017::LY-197055
SMILES CC1CC(=O)NN=C1c1ccc2NC(=O)C(C)(C)c2c1
InChI Key InChIKey=POOZXNMBPQYVQV-UHFFFAOYSA-N
Data  1 KI  1 IC50
  Tab Delimited (TSV)   2D SDfile   Computed 3D by Vconf -m prep SDfile
Find this compound or compounds like it in BindingDB:
Activity Spreadsheet -- Enzyme Inhibition Constant Data from BindingDB
Found 2 hits for monomerid = 50228247
TargetcAMP-specific 3',5'-cyclic phosphodiesterase 4A/4B/4C/4D(Homo sapiens (Human))
Eli Lilly
Curated by ChEMBL
LigandPNGBDBM50228247(CHEMBL38017 | LY-197055)
Affinity DataKi:  0.540nM. Assay description: Displacement [3H]LY-186,126 from phosphodiesterase 4 of myocardial vesicles
In DepthDetails ArticlePubMed
TargetcGMP-inhibited 3',5'-cyclic phosphodiesterase 3A/3B(Homo sapiens (Human))
Vrije Universiteit
Curated by ChEMBL
LigandPNGBDBM50228247(CHEMBL38017 | LY-197055)
Affinity DataIC50:  13nM. Assay description: Inhibition of dual cGMP-inhibited phosphodiesterase 3 (PDE3) was determined in homogenates from human platelets.
In DepthDetails ArticlePubMed