BDBM50228567 CHEMBL2092931
SMILES CC(=O)N1CCCCC[C@H]1C#CCN1CCCC1
InChI Key InChIKey=WULCBOSTMCYKCZ-HNNXBMFYSA-N
Data  1 Kd
  Tab Delimited (TSV)   2D SDfile   Computed 3D by Vconf -m prep SDfile
Find this compound or compounds like it in BindingDB:
Activity Spreadsheet -- Enzyme Inhibition Constant Data from BindingDB
Found 1 hit for monomerid = 50228567
TargetMuscarinic acetylcholine receptor M1/M2/M3/M4/M5(Homo sapiens (Human))
Uppsala University
Curated by ChEMBL
LigandPNGBDBM50228567(CHEMBL2092931)
Affinity DataKd:  7.85E+3nM. Assay description: Dissociation constant towards Muscarinic acetylcholine receptor in guinea pig ileum
In DepthDetails ArticlePubMed