BDBM50230014 CHEMBL320262
SMILES CSCC1=C[C@H]([C@H](O)[C@@H]1O)n1cnc2c(N)ncnc12
InChI Key InChIKey=BDXQCQPOGKWBCU-QNSHHTMESA-N
Data  1 IC50
  Tab Delimited (TSV)   2D SDfile   Computed 3D by Vconf -m prep SDfile
Find this compound or compounds like it in BindingDB:
Activity Spreadsheet -- Enzyme Inhibition Constant Data from BindingDB
Found 1 hit for monomerid = 50230014
TargetAdenosylhomocysteinase(Homo sapiens (Human))
Toyo Jozo
Curated by ChEMBL
LigandPNGBDBM50230014(CHEMBL320262)
Affinity DataIC50: >3.40E+4nM. Assay description: Inhibitory effect against S-adenosyl-L-homocysteine hydrolase of rabbit erythrocyte.
In DepthDetails ArticlePubMed