BDBM50231938 (2,5-dimethyloxazol-4-yl)methyl (R)-1-((4S,5S,7R)-8-((S)-1-(tert-butylamino)-3-methyl-1-oxobutan-2-ylamino)-5-hydroxy-2,7-dimethyl-8-oxooctan-4-ylamino)-3-(methylsulfonyl)-1-oxopropan-2-ylcarbamate::CHEMBL254740
SMILES CC(C)C[C@H](NC(=O)[C@H](CS(C)(=O)=O)NC(=O)OCc1nc(C)oc1C)[C@@H](O)C[C@@H](C)C(=O)N[C@@H](C(C)C)C(=O)NC(C)(C)C
InChI Key InChIKey=GHQQZCMHUTUMJU-YJVJNSLESA-N
Data  1 KI
  Tab Delimited (TSV)   2D SDfile   Computed 3D by Vconf -m prep SDfile
Find this compound or compounds like it in BindingDB:
Activity Spreadsheet -- Enzyme Inhibition Constant Data from BindingDB
Found 1 hit for monomerid = 50231938
TargetBeta-secretase 1(Homo sapiens (Human))
Purdue University
Curated by ChEMBL
LigandPNGBDBM50231938((2,5-dimethyloxazol-4-yl)methyl (R)-1-((4S,5S,7R)-...)
Affinity DataKi:  0.120nM. Assay description: Binding affinity to recombinant memapsin 2
In DepthDetails ArticlePubMed