BDBM50232009 CHEMBL4094729
SMILES COC1(OC(=O)C(CC\C=C(/C)CC\C=C(/C)C=O)=C1)c1cc(O)ccc1O
InChI Key InChIKey=MOFNDUJXTNIVEF-BGPOSVGRSA-N
Data  2 IC50
  Tab Delimited (TSV)   2D SDfile   Computed 3D by Vconf -m prep SDfile
Find this compound or compounds like it in BindingDB:
Activity Spreadsheet -- Enzyme Inhibition Constant Data from BindingDB
Found 2 hits for monomerid = 50232009
TargetSucrase-isomaltase, intestinal(Rattus norvegicus (Rat))
Chinese Academy Of Sciences
Curated by ChEMBL
LigandPNGBDBM50232009(CHEMBL4094729)
Affinity DataIC50: >1.00E+5nM. Assay description: Inhibition of sucrase in rat small intestinal mucosa assessed as reduction in glucose production using sucrose as substrate measured after 40 mins by...
In DepthDetails ArticlePubMed
Target3-hydroxy-3-methylglutaryl-coenzyme A reductase(Sus scrofa)
Chinese Academy Of Sciences
Curated by ChEMBL
LigandPNGBDBM50232009(CHEMBL4094729)
Affinity DataIC50:  5.69E+4nM. Assay description: Inhibition of HMG-CoA reductase in pig liver microsomes using HMG-CoA as substrate preincubated for 5 mins followed by NADPH addition measured after ...
In DepthDetails ArticlePubMed