BDBM50232519 (2R)-4-[8-[3,5-bis(trifluoromethyl)benzyl]-3-(trifluoromethyl)-5,6-dihydro [1,2,4]triazolo[4,3-a]pyrazin-7(8H)-yl]-4-oxo-1-(2,4,5-trifluorophenyl)butan-2-amine hydrochloride::CHEMBL536312
SMILES N[C@@H](CC(=O)N1CCn2c(nnc2C(F)(F)F)C1Cc1cc(cc(c1)C(F)(F)F)C(F)(F)F)Cc1cc(F)c(F)cc1F
InChI Key InChIKey=LZHNXTZICCTVCO-NYRJJRHWSA-N
Data  14 IC50
  Tab Delimited (TSV)   2D SDfile   Computed 3D by Vconf -m prep SDfile
Find this compound or compounds like it in BindingDB:
Activity Spreadsheet -- Enzyme Inhibition Constant Data from BindingDB
Found 14 hits for monomerid = 50232519
TargetProlyl endopeptidase FAP(Homo sapiens (Human))
Merck Research Laboratories
Curated by ChEMBL
LigandPNGBDBM50232519((2R)-4-[8-[3,5-bis(trifluoromethyl)benzyl]-3-(trif...)
Affinity DataIC50: >1.00E+4nM. Assay description: Inhibition of FAP
In DepthDetails ArticlePubMed
TargetDipeptidyl peptidase 9(Homo sapiens (Human))
Merck Research Laboratories
Curated by ChEMBL
LigandPNGBDBM50232519((2R)-4-[8-[3,5-bis(trifluoromethyl)benzyl]-3-(trif...)
Affinity DataIC50: >1.00E+5nM. Assay description: Inhibition of DPP9
In DepthDetails ArticlePubMed
TargetDipeptidyl peptidase 4(Homo sapiens (Human))
Merck Research Laboratories
Curated by ChEMBL
LigandPNGBDBM50232519((2R)-4-[8-[3,5-bis(trifluoromethyl)benzyl]-3-(trif...)
Affinity DataIC50:  6.30nM. Assay description: Inhibition of DPP4
In DepthDetails ArticlePubMed
TargetDipeptidyl peptidase 2(Homo sapiens (Human))
Merck Research Laboratories
Curated by ChEMBL
LigandPNGBDBM50232519((2R)-4-[8-[3,5-bis(trifluoromethyl)benzyl]-3-(trif...)
Affinity DataIC50: >1.00E+5nM. Assay description: Inhibition of QPP
In DepthDetails ArticlePubMed
TargetXaa-Pro aminopeptidase 1(Homo sapiens (Human))
Merck Research Laboratories
Curated by ChEMBL
LigandPNGBDBM50232519((2R)-4-[8-[3,5-bis(trifluoromethyl)benzyl]-3-(trif...)
Affinity DataIC50: >1.00E+4nM. Assay description: Inhibition of amino peptidase P
In DepthDetails ArticlePubMed
TargetXaa-Pro aminopeptidase 1(Homo sapiens (Human))
Merck Research Laboratories
Curated by ChEMBL
LigandPNGBDBM50232519((2R)-4-[8-[3,5-bis(trifluoromethyl)benzyl]-3-(trif...)
Affinity DataIC50: >1.00E+4nM. Assay description: Inhibition of amino peptidase P
In DepthDetails ArticlePubMed
TargetDipeptidyl peptidase 4(Homo sapiens (Human))
Merck Research Laboratories
Curated by ChEMBL
LigandPNGBDBM50232519((2R)-4-[8-[3,5-bis(trifluoromethyl)benzyl]-3-(trif...)
Affinity DataIC50:  6.30nM. Assay description: Inhibition of DPP4
In DepthDetails ArticlePubMed
TargetDipeptidyl peptidase 8(Homo sapiens (Human))
Merck Research Laboratories
Curated by ChEMBL
LigandPNGBDBM50232519((2R)-4-[8-[3,5-bis(trifluoromethyl)benzyl]-3-(trif...)
Affinity DataIC50: >1.00E+5nM. Assay description: Inhibition of DPP8
In DepthDetails ArticlePubMed
TargetDipeptidyl peptidase 8(Homo sapiens (Human))
Merck Research Laboratories
Curated by ChEMBL
LigandPNGBDBM50232519((2R)-4-[8-[3,5-bis(trifluoromethyl)benzyl]-3-(trif...)
Affinity DataIC50: >1.00E+5nM. Assay description: Inhibition of DPP8
In DepthDetails ArticlePubMed
TargetDipeptidyl peptidase 9(Homo sapiens (Human))
Merck Research Laboratories
Curated by ChEMBL
LigandPNGBDBM50232519((2R)-4-[8-[3,5-bis(trifluoromethyl)benzyl]-3-(trif...)
Affinity DataIC50: >1.00E+5nM. Assay description: Inhibition of DPP9
In DepthDetails ArticlePubMed
TargetXaa-Pro dipeptidase(Homo sapiens (Human))
Merck Research Laboratories
Curated by ChEMBL
LigandPNGBDBM50232519((2R)-4-[8-[3,5-bis(trifluoromethyl)benzyl]-3-(trif...)
Affinity DataIC50: >1.00E+4nM. Assay description: Inhibition of prolidase
In DepthDetails ArticlePubMed
TargetDipeptidyl peptidase 2(Homo sapiens (Human))
Merck Research Laboratories
Curated by ChEMBL
LigandPNGBDBM50232519((2R)-4-[8-[3,5-bis(trifluoromethyl)benzyl]-3-(trif...)
Affinity DataIC50: >1.00E+5nM. Assay description: Inhibition of QPP
In DepthDetails ArticlePubMed
TargetXaa-Pro dipeptidase(Homo sapiens (Human))
Merck Research Laboratories
Curated by ChEMBL
LigandPNGBDBM50232519((2R)-4-[8-[3,5-bis(trifluoromethyl)benzyl]-3-(trif...)
Affinity DataIC50: >1.00E+4nM. Assay description: Inhibition of prolidase
In DepthDetails ArticlePubMed
TargetProlyl endopeptidase FAP(Homo sapiens (Human))
Merck Research Laboratories
Curated by ChEMBL
LigandPNGBDBM50232519((2R)-4-[8-[3,5-bis(trifluoromethyl)benzyl]-3-(trif...)
Affinity DataIC50: >1.00E+4nM. Assay description: Inhibition of FAP
In DepthDetails ArticlePubMed