BDBM50232521 (2R)-4-[(6R)-6-methyl-3-(trifluoromethyl)-5,6-dihydro[[1,2,4]triazolo[4,3-a]pyrazin-7(8H)-yl]-4-oxo-1-(2,4,5-trifluorophenyl)butan-2-amine hydrochloride::CHEMBL553787
SMILES C[C@@H]1Cn2c(CN1C(=O)C[C@H](N)Cc1cc(F)c(F)cc1F)nnc2C(F)(F)F
InChI Key InChIKey=VXEJFPVVOIXCFP-PSASIEDQSA-N
Data  7 IC50
  Tab Delimited (TSV)   2D SDfile   Computed 3D by Vconf -m prep SDfile
Find this compound or compounds like it in BindingDB:
Activity Spreadsheet -- Enzyme Inhibition Constant Data from BindingDB
Found 7 hits for monomerid = 50232521
TargetDipeptidyl peptidase 2(Homo sapiens (Human))
Merck Research Laboratories
Curated by ChEMBL
LigandPNGBDBM50232521((2R)-4-[(6R)-6-methyl-3-(trifluoromethyl)-5,6-dihy...)
Affinity DataIC50: >1.00E+5nM. Assay description: Inhibition of QPP
In DepthDetails ArticlePubMed
TargetProlyl endopeptidase FAP(Homo sapiens (Human))
Merck Research Laboratories
Curated by ChEMBL
LigandPNGBDBM50232521((2R)-4-[(6R)-6-methyl-3-(trifluoromethyl)-5,6-dihy...)
Affinity DataIC50: >1.00E+4nM. Assay description: Inhibition of FAP
In DepthDetails ArticlePubMed
TargetXaa-Pro aminopeptidase 1(Homo sapiens (Human))
Merck Research Laboratories
Curated by ChEMBL
LigandPNGBDBM50232521((2R)-4-[(6R)-6-methyl-3-(trifluoromethyl)-5,6-dihy...)
Affinity DataIC50: >1.00E+4nM. Assay description: Inhibition of amino peptidase P
In DepthDetails ArticlePubMed
TargetDipeptidyl peptidase 4(Homo sapiens (Human))
Merck Research Laboratories
Curated by ChEMBL
LigandPNGBDBM50232521((2R)-4-[(6R)-6-methyl-3-(trifluoromethyl)-5,6-dihy...)
Affinity DataIC50:  42nM. Assay description: Inhibition of DPP4
In DepthDetails ArticlePubMed
TargetDipeptidyl peptidase 8(Homo sapiens (Human))
Merck Research Laboratories
Curated by ChEMBL
LigandPNGBDBM50232521((2R)-4-[(6R)-6-methyl-3-(trifluoromethyl)-5,6-dihy...)
Affinity DataIC50:  7.50E+4nM. Assay description: Inhibition of DPP8
In DepthDetails ArticlePubMed
TargetDipeptidyl peptidase 9(Homo sapiens (Human))
Merck Research Laboratories
Curated by ChEMBL
LigandPNGBDBM50232521((2R)-4-[(6R)-6-methyl-3-(trifluoromethyl)-5,6-dihy...)
Affinity DataIC50: >1.00E+5nM. Assay description: Inhibition of DPP9
In DepthDetails ArticlePubMed
TargetXaa-Pro dipeptidase(Homo sapiens (Human))
Merck Research Laboratories
Curated by ChEMBL
LigandPNGBDBM50232521((2R)-4-[(6R)-6-methyl-3-(trifluoromethyl)-5,6-dihy...)
Affinity DataIC50: >1.00E+4nM. Assay description: Inhibition of prolidase
In DepthDetails ArticlePubMed