BDBM50233960 CHEMBL4102397
SMILES Oc1ccc(cc1)-c1ccc(cc1)-c1cc(NCc2cccnc2)n2ncc(Br)c2n1
InChI Key InChIKey=DBSVHPMLFZFRMB-UHFFFAOYSA-N
Data  1 IC50
  Tab Delimited (TSV)   2D SDfile   Computed 3D by Vconf -m prep SDfile
Find this compound or compounds like it in BindingDB:
Activity Spreadsheet -- Enzyme Inhibition Constant Data from BindingDB
Found 1 hit for monomerid = 50233960
TargetCyclin-dependent kinase 2/G1/S-specific cyclin-E1(Homo sapiens (Human))
Masaryk University
Curated by ChEMBL
LigandPNGBDBM50233960(CHEMBL4102397)
Affinity DataIC50:  140nM. Assay description: Inhibition of CDK2/cyclin E (unknown origin) expressed in baculovirus infected insect Sf9 cells using histone H1 as substrate in presence of [gamma-3...
In DepthDetails ArticlePubMed