BDBM50234744 CHEMBL4101070
SMILES C[C@H]1[C@H](NC(=O)OCCCCC2CCCCC2)C(=O)N1Oc1ccc(cc1)S(C)(=O)=O
InChI Key InChIKey=DDTXJCHBNPVFCG-JXFKEZNVSA-N
Data  2 IC50
  Tab Delimited (TSV)   2D SDfile   Computed 3D by Vconf -m prep SDfile
Find this compound or compounds like it in BindingDB:
Activity Spreadsheet -- Enzyme Inhibition Constant Data from BindingDB
Found 2 hits for monomerid = 50234744
TargetAcid ceramidase(Homo sapiens (Human))
Istituto Italiano Di Tecnologia
Curated by ChEMBL
LigandPNGBDBM50234744(CHEMBL4101070)
Affinity DataIC50:  2.02E+3nM. Assay description: Inhibition of human acid ceramidase expressed in HEK293 cells using N-[(1S,2R)-2-hydroxy-1-(hydroxymethyl)-4-(2-oxochromen-7-yl)-oxybutyl]dodecanamid...
In DepthDetails ArticlePubMed
TargetN-acylethanolamine-hydrolyzing acid amidase(Homo sapiens (Human))
Istituto Italiano Di Tecnologia
Curated by ChEMBL
LigandPNGBDBM50234744(CHEMBL4101070)
Affinity DataIC50:  6nM. Assay description: Inhibition of recombinant human spleen NAAA expressed in HEK293 cells using PAMCA as substrate preincubated for 10 mins followed by substrate additio...
In DepthDetails ArticlePubMed