BDBM50235227 CHEMBL4069506
SMILES Clc1cccc(c1Cl)-c1cc(=O)c2ccc3ccccc3c2o1
InChI Key InChIKey=WDNHSGHWXOFHOH-UHFFFAOYSA-N
Data  1 IC50
  Tab Delimited (TSV)   2D SDfile   Computed 3D by Vconf -m prep SDfile
Find this compound or compounds like it in BindingDB:
Activity Spreadsheet -- Enzyme Inhibition Constant Data from BindingDB
Found 1 hit for monomerid = 50235227
TargetCarboxylic ester hydrolase(Sus scrofa)
Guru Nanak Dev University
Curated by ChEMBL
LigandPNGBDBM50235227(CHEMBL4069506)
Affinity DataIC50:  11nM. Assay description: Inhibition of porcine cholesterol esterase using para-nitrophenyl butyrate as substrate after 5 mins in presence of sodium taurocholate by spectropho...
In DepthDetails ArticlePubMed