BDBM50235647 CHEMBL4068192
SMILES CN(C)[C@H]1CN(Cc2c(C)cccc2F)C[C@@H]1c1ccc(cc1)-c1cnn(CC(N)=O)c1
InChI Key InChIKey=BHCIUNLNTMWBGM-VWNXMTODSA-N
Data  1 KI
PDB links: 1 PDB ID matches this monomer.
  Tab Delimited (TSV)   2D SDfile   Computed 3D by Vconf -m prep SDfile
Find this compound or compounds like it in BindingDB:
Activity Spreadsheet -- Enzyme Inhibition Constant Data from BindingDB
Found 1 hit for monomerid = 50235647
TargetPolycomb protein EED(Homo sapiens (Human))
Abbvie
Curated by ChEMBL
LigandPNGBDBM50235647(CHEMBL4068192)
Affinity DataKi:  2.60nM. Assay description: In vitro inhibitory activity against neutral endopeptidase (NEP) from rat kidney