BDBM50235649 CHEMBL4059553
SMILES CN(C)[C@H]1CN(Cc2c(C)cccc2F)C[C@@H]1c1ccc(cc1)N1CCN(CC1)c1ccccn1
InChI Key InChIKey=VMSIIOOXZUWIAD-IAPPQJPRSA-N
Data  1 KI
  Tab Delimited (TSV)   2D SDfile   Computed 3D by Vconf -m prep SDfile
Find this compound or compounds like it in BindingDB:
Activity Spreadsheet -- Enzyme Inhibition Constant Data from BindingDB
Found 1 hit for monomerid = 50235649
TargetPolycomb protein EED(Homo sapiens (Human))
Abbvie
Curated by ChEMBL
LigandPNGBDBM50235649(CHEMBL4059553)
Affinity DataKi:  2.10nM. Assay description: Inhibition of OG(488) labeled probe binding to GST-tagged EED (unknown origin) after 1 hr by LanthaScreen TR-FRET assay
In DepthDetails ArticlePubMed