BDBM50236619 CHEMBL4070236
SMILES [H][C@]12CC[C@]([H])(O1)[C@@H]([C@@H]2N(C)S(=O)(=O)c1ccc(OCc2cc(C)nc3ccccc23)cc1)C(=O)NO
InChI Key InChIKey=WQWVTFKKGIYLJY-UARRHKHWSA-N
Data  4 IC50
  Tab Delimited (TSV)   2D SDfile   Computed 3D by Vconf -m prep SDfile
Find this compound or compounds like it in BindingDB:
Activity Spreadsheet -- Enzyme Inhibition Constant Data from BindingDB
Found 4 hits for monomerid = 50236619
TargetDisintegrin and metalloproteinase domain-containing protein 17(Homo sapiens (Human))
Nestl�
Curated by ChEMBL
LigandPNGBDBM50236619(CHEMBL4070236)
Affinity DataIC50:  1.10nM. Assay description: Inhibition of recombinant TACE catalytic domain (unknown origin) using Abz-LAQAVRSSSR-Dpa as substrate preincubated for 10 mins followed by substrate...
In DepthDetails ArticlePubMed
TargetDisintegrin and metalloproteinase domain-containing protein 17(Mus musculus (Mouse))
Nestl�
Curated by ChEMBL
LigandPNGBDBM50236619(CHEMBL4070236)
Affinity DataIC50:  10nM. Assay description: Inhibition of fibrinogen binding to integrin alphaIIb-beta3
In DepthDetails ArticlePubMed
TargetDisintegrin and metalloproteinase domain-containing protein 17(Mus musculus (Mouse))
Nestl�
Curated by ChEMBL
LigandPNGBDBM50236619(CHEMBL4070236)
Affinity DataIC50:  10nM. Assay description: Inhibition of TACE in mouse RAW264.7 cells assessed as inhibition of LPS-stimulated TNFalpha production pretreated for 1 hr followed by LPS stimulati...
In DepthDetails ArticlePubMed
TargetDisintegrin and metalloproteinase domain-containing protein 17(Homo sapiens (Human))
Nestl�
Curated by ChEMBL
LigandPNGBDBM50236619(CHEMBL4070236)
Affinity DataIC50:  1nM. Assay description: Inhibition of [3H]-5-HT binding to serotonin transporter of rat brain synaptosomes
In DepthDetails ArticlePubMed