BDBM50236762 CHEMBL4071830
SMILES [H][C@]12C[C@]1([C@@H](O)[C@@H](O)[C@@H]2n1cnc2c(NC)nc(nc12)C#Cc1ccc(Br)s1)C(=O)OC
InChI Key InChIKey=RJBNRAHSRNPIGX-AQPYCOETSA-N
Data  4 KI  3 IC50  6 EC50
  Tab Delimited (TSV)   2D SDfile   Computed 3D by Vconf -m prep SDfile
Find this compound or compounds like it in BindingDB:
Activity Spreadsheet -- Enzyme Inhibition Constant Data from BindingDB
Found 13 hits for monomerid = 50236762
TargetTransmembrane domain-containing protein TMIGD3(Homo sapiens (Human))
National Institute Of Diabetes And Digestive And Kidney Diseases
Curated by ChEMBL
LigandPNGBDBM50236762(CHEMBL4071830)
Affinity DataKi:  8.60nM. Assay description: Displacement of [125I]N6-(4-amino-3-iodobenzyl)adenosine-5'-N-methyluronamide from human A3AR expressed in HEK293T cells pre-incubated for 10 mins be...
In DepthDetails ArticlePubMed
Target5-hydroxytryptamine receptor 2C(Homo sapiens (Human))
National Institute Of Diabetes And Digestive And Kidney Diseases
Curated by ChEMBL
LigandPNGBDBM50236762(CHEMBL4071830)
Affinity DataKi:  258nM. Assay description: Displacement of [3H]Mesulergine from human 5-HT2C receptor
In DepthDetails ArticlePubMed
TargetSodium-dependent serotonin transporter(Homo sapiens (Human))
National Institute Of Diabetes And Digestive And Kidney Diseases
Curated by ChEMBL
LigandPNGBDBM50236762(CHEMBL4071830)
Affinity DataKi: <1.00E+4nM. Assay description: Concentration required to inhibit binding of ICAM-1 to LFA-1 (Leukocyte function-associated antigen-1), evaluated ELISA
In DepthDetails ArticlePubMed
TargetSodium-dependent serotonin transporter(Homo sapiens (Human))
National Institute Of Diabetes And Digestive And Kidney Diseases
Curated by ChEMBL
LigandPNGBDBM50236762(CHEMBL4071830)
Affinity DataKi: <1.00E+4nM. Assay description: Inhibit of purified bovine Farnesyl protein transferase.
In DepthDetails ArticlePubMed
TargetSodium-dependent noradrenaline transporter(Homo sapiens (Human))
National Institute Of Diabetes And Digestive And Kidney Diseases
Curated by ChEMBL
LigandPNGBDBM50236762(CHEMBL4071830)
Affinity DataIC50:  3.56E+3nM. Assay description: Concentration required to inhibit binding of ICAM-1 to LFA-1 (Leukocyte function-associated antigen-1), evaluated ELISA
In DepthDetails ArticlePubMed
TargetSodium-dependent dopamine transporter(Homo sapiens (Human))
National Institute Of Diabetes And Digestive And Kidney Diseases
Curated by ChEMBL
LigandPNGBDBM50236762(CHEMBL4071830)
Affinity DataIC50:  246nM. Assay description: In vitro binding affinity to displace [3H]spiperone from the cloned human dopamine receptor D2 long in CHO cells
In DepthDetails ArticlePubMed
TargetSodium-dependent serotonin transporter(Homo sapiens (Human))
National Institute Of Diabetes And Digestive And Kidney Diseases
Curated by ChEMBL
LigandPNGBDBM50236762(CHEMBL4071830)
Affinity DataEC50: >1.00E+4nM. Assay description: Enhancing of [3H]mazindol binding to recombinant human SERT expressed in HEK293 cell membranes preincubated for 10 mins followed by radioligand addit...
In DepthDetails ArticlePubMed
TargetSodium-dependent serotonin transporter(Homo sapiens (Human))
National Institute Of Diabetes And Digestive And Kidney Diseases
Curated by ChEMBL
LigandPNGBDBM50236762(CHEMBL4071830)
Affinity DataIC50: >10nM. Assay description: Inhibition of recombinant human SERT expressed in HEK293 cell membranes assessed as reduction in [3H]5-HT uptake incubated for 22 mins by micro beta ...
In DepthDetails ArticlePubMed
TargetSodium-dependent dopamine transporter(Homo sapiens (Human))
National Institute Of Diabetes And Digestive And Kidney Diseases
Curated by ChEMBL
LigandPNGBDBM50236762(CHEMBL4071830)
Affinity DataEC50:  54nM. Assay description: Enhancing of [125I]RTI-55 binding to recombinant human DAT expressed in HEK293 cell membranes preincubated for 10 mins followed by radioligand additi...
In DepthDetails ArticlePubMed
TargetSodium-dependent serotonin transporter(Homo sapiens (Human))
National Institute Of Diabetes And Digestive And Kidney Diseases
Curated by ChEMBL
LigandPNGBDBM50236762(CHEMBL4071830)
Affinity DataEC50: >1.00E+4nM. Assay description: Inhibit of purified bovine Farnesyl protein transferase.
In DepthDetails ArticlePubMed
TargetSodium-dependent dopamine transporter(Homo sapiens (Human))
National Institute Of Diabetes And Digestive And Kidney Diseases
Curated by ChEMBL
LigandPNGBDBM50236762(CHEMBL4071830)
Affinity DataEC50:  308nM. Assay description: Concentration required to inhibit binding of ICAM-1 to LFA-1 (Leukocyte function-associated antigen-1), evaluated ELISA
In DepthDetails ArticlePubMed
TargetSodium-dependent noradrenaline transporter(Homo sapiens (Human))
National Institute Of Diabetes And Digestive And Kidney Diseases
Curated by ChEMBL
LigandPNGBDBM50236762(CHEMBL4071830)
Affinity DataEC50:  400nM. Assay description: Concentration required to inhibit binding of ICAM-1 to LFA-1 (Leukocyte function-associated antigen-1), evaluated ELISA
In DepthDetails ArticlePubMed
TargetSodium-dependent noradrenaline transporter(Homo sapiens (Human))
National Institute Of Diabetes And Digestive And Kidney Diseases
Curated by ChEMBL
LigandPNGBDBM50236762(CHEMBL4071830)
Affinity DataEC50: >1.00E+4nM. Assay description: Enhancing of [3H]mazindol binding to recombinant human NET expressed in HEK293 cell membranes preincubated for 10 mins followed by radioligand additi...
In DepthDetails ArticlePubMed