BDBM50237 (phenylmethyl) N-[3-(1H-indol-3-yl)-1-[2-[(E)-(3-methoxy-5-nitro-4-oxidanylidene-cyclohexa-2,5-dien-1-ylidene)methyl]hydrazinyl]-1-oxidanylidene-propan-2-yl]carbamate::MLS000554491::N-[1-(1H-indol-3-ylmethyl)-2-keto-2-[N'-[(E)-(4-keto-3-methoxy-5-nitro-cyclohexa-2,5-dien-1-ylidene)methyl]hydrazino]ethyl]carbamic acid benzyl ester::N-[3-(1H-indol-3-yl)-1-[[(E)-(3-methoxy-5-nitro-4-oxo-1-cyclohexa-2,5-dienylidene)methyl]hydrazo]-1-oxopropan-2-yl]carbamic acid (phenylmethyl) ester::SMR000171942::[1-(4-Hydroxy-3-methoxy-5-nitro-benzylidene-hydrazinocarbonyl)-2-(1H-indol-3-yl)-ethyl]-carbamic acid benzyl ester::benzyl N-[3-(1H-indol-3-yl)-1-[2-[(E)-(3-methoxy-5-nitro-4-oxocyclohexa-2,5-dien-1-ylidene)methyl]hydrazinyl]-1-oxopropan-2-yl]carbamate::cid_5763449
SMILES COc1c[c-](C=[NH+]NC(=O)C(Cc2c[nH]c3ccccc23)NC(=O)OCc2ccccc2)cc([N+]([O-])=O)c1=O
InChI Key InChIKey=XZOGWYZLYIUQHM-UHFFFAOYSA-O
Data  2 IC50
  Tab Delimited (TSV)   2D SDfile   Computed 3D by Vconf -m prep SDfile
Find this compound or compounds like it in BindingDB:
Activity Spreadsheet -- Enzyme Inhibition Constant Data from BindingDB
Found 2 hits for monomerid = 50237
TargetM1 family aminopeptidase(Plasmodium falciparum (isolate FcB1 / Columbia))
Srmlsc
Curated by PubChem BioAssay
LigandPNGBDBM50237((phenylmethyl) N-[3-(1H-indol-3-yl)-1-[2-[(E)-(3-m...)
Affinity DataIC50:  4.75E+3nM. Assay description: Southern Research Molecular Libraries Screening Center (SRMLSC) Southern Research Institute (Birmingham, Alabama) NIH Molecular Libraries Screening...
In DepthDetails PCBioAssay
TargetInduced myeloid leukemia cell differentiation protein Mcl-1(Homo sapiens (Human))
Emory University
Curated by PubChem BioAssay
LigandPNGBDBM50237((phenylmethyl) N-[3-(1H-indol-3-yl)-1-[2-[(E)-(3-m...)
Affinity DataIC50:  6.11E+3nM. Assay description: NIH Molecular Libraries Screening Centers Network [MLSCN] Emory Chemical Biology Discovery Center in MLSCN Assay provider: Nikolovska-Coleska, Univer...
In DepthDetails PCBioAssay