BDBM50237607 Ansamycin::CHEBI:45367::LM-427::Mycobutin::Rifabutin
SMILES CO[C@H]1\C=C\O[C@@]2(C)Oc3c(C2=O)c2C4=NC5(CCN(CC(C)C)CC5)NC4=C(NC(=O)\C(C)=C/C=C/[C@H](C)[C@H](O)[C@@H](C)[C@@H](O)[C@@H](C)[C@H](OC(C)=O)[C@@H]1C)C(=O)c2c(O)c3C
InChI Key InChIKey=ATEBXHFBFRCZMA-VXTBVIBXSA-N
Data  6 IC50
PDB links: 4 PDB IDs match this monomer.
  Tab Delimited (TSV)   2D SDfile   Computed 3D by Vconf -m prep SDfile
Find this compound or compounds like it in BindingDB:
Activity Spreadsheet -- Enzyme Inhibition Constant Data from BindingDB
Found 6 hits for monomerid = 50237607
TargetBile salt export pump(Homo sapiens (Human))
Amgen
Curated by ChEMBL
LigandPNGBDBM50237607(Ansamycin | CHEBI:45367 | LM-427 | Mycobutin | Rif...)
Affinity DataIC50:  2.67E+4nM. Assay description: Inhibition of human BSEP expressed in fall armyworm sf9 cell plasma membrane vesicles assessed as reduction in vesicle-associated [3H]-taurocholate t...
In DepthDetails ArticlePubMed
TargetBile salt export pump(Homo sapiens (Human))
Amgen
Curated by ChEMBL
LigandPNGBDBM50237607(Ansamycin | CHEBI:45367 | LM-427 | Mycobutin | Rif...)
Affinity DataIC50:  2.67E+4nM. Assay description: Ability to inhibit the binding of [125I]RT155 to hNET in HEK cells
In DepthDetails ArticlePubMed
TargetATP-binding cassette sub-family C member 4(Homo sapiens (Human))
Amgen
Curated by ChEMBL
LigandPNGBDBM50237607(Ansamycin | CHEBI:45367 | LM-427 | Mycobutin | Rif...)
Affinity DataIC50:  1.59E+4nM. Assay description: Inhibition of human MRP4 overexpressed in Sf9 cell membrane vesicles assessed as uptake of [3H]-estradiol-17beta-D-glucuronide in presence of ATP and...
In DepthDetails ArticlePubMed
TargetATP-binding cassette sub-family C member 2(Homo sapiens (Human))
Amgen
Curated by ChEMBL
LigandPNGBDBM50237607(Ansamycin | CHEBI:45367 | LM-427 | Mycobutin | Rif...)
Affinity DataIC50:  4.98E+4nM. Assay description: Inhibition of human MRP2 overexpressed in Sf9 cell membrane vesicles assessed as uptake of [3H]-estradiol-17beta-D-glucuronide in presence of ATP and...
In DepthDetails ArticlePubMed
TargetATP-binding cassette sub-family C member 3(Homo sapiens (Human))
Amgen
Curated by ChEMBL
LigandPNGBDBM50237607(Ansamycin | CHEBI:45367 | LM-427 | Mycobutin | Rif...)
Affinity DataIC50: >1.33E+5nM. Assay description: Inhibition of human MRP3 overexpressed in Sf9 insect cell membrane vesicles assessed as uptake of [3H]-estradiol-17beta-D-glucuronide in presence of ...
In DepthDetails ArticlePubMed
TargetBile salt export pump(Homo sapiens (Human))
Amgen
Curated by ChEMBL
LigandPNGBDBM50237607(Ansamycin | CHEBI:45367 | LM-427 | Mycobutin | Rif...)
Affinity DataIC50:  2.67E+4nM. Assay description: Inhibition of human BSEP overexpressed in Sf9 cell membrane vesicles assessed as uptake of [3H]-taurocholate in presence of ATP measured after 15 to ...
In DepthDetails ArticlePubMed