BDBM50239120 CHEMBL4101005
SMILES Fc1cc(F)cc(c1)N1CCC[C@@H]1c1cc(cc2c1oc(cc2=O)N1CCOCC1)C(=O)N1CC1
InChI Key InChIKey=UEWDSORTWUIOPN-JOCHJYFZSA-N
Data  1 IC50
  Tab Delimited (TSV)   2D SDfile   Computed 3D by Vconf -m prep SDfile
Find this compound or compounds like it in BindingDB:
Activity Spreadsheet -- Enzyme Inhibition Constant Data from BindingDB
Found 1 hit for monomerid = 50239120
LigandPNGBDBM50239120(CHEMBL4101005)
Affinity DataIC50:  1.40nM. Assay description: Inhibition of PI3Kbeta in PTEN-deficient human MDA-MB-468 cells assessed as decrease in AKT phosphorylation at Ser473 measured after 2 hrs
In DepthDetails ArticlePubMed