BDBM50239504 CHEMBL4061890::US10329302, Example 262::US10793579, Example 262::US11702424, Example 262
SMILES COc1cc2c(OC[C@@H]3CCC(=O)N3)ccnc2cc1C(N)=O
InChI Key InChIKey=IUEIQDIJUPIDTQ-VIFPVBQESA-N
Data  5 IC50
  Tab Delimited (TSV)   2D SDfile   Computed 3D by Vconf -m prep SDfile
Find this compound or compounds like it in BindingDB:
Activity Spreadsheet -- Enzyme Inhibition Constant Data from BindingDB
Found 5 hits for monomerid = 50239504
TargetInterleukin-1 receptor-associated kinase 4(Homo sapiens (Human))
Pfizer
Curated by ChEMBL
LigandPNGBDBM50239504(CHEMBL4061890 | US10329302, Example 262 | US107935...)
Affinity DataIC50:  5.90nM. Assay description: Inhibition of N-terminal His6-tagged human full length IRAK4 preincubated for 20 mins followed by biotinylated-AGAGRDKYKTLRQIR substrate addition in ...
In DepthDetails ArticlePubMed
TargetInterleukin-1 receptor-associated kinase 4(Homo sapiens (Human))
Pfizer
Curated by ChEMBL
LigandPNGBDBM50239504(CHEMBL4061890 | US10329302, Example 262 | US107935...)
Affinity DataIC50:  2.12E+3nM. Assay description: Inhibition of IRAK4 in human PBMC assessed as reduction in R848-stimulated TNF alpha production after 3 hrs
In DepthDetails ArticlePubMed
TargetInterleukin-1 receptor-associated kinase 4(Homo sapiens (Human))
Pfizer
Curated by ChEMBL
LigandPNGBDBM50239504(CHEMBL4061890 | US10329302, Example 262 | US107935...)
Affinity DataIC50:  4.70nM. Assay description: This is an in vitro assay to measure IRAK4 enzymatic activity utilizing the DELFIA (Dissociation-Enhanced Lanthanide Fluorescent Immunoassay, Perkin-...
In DepthDetails US Patent
TargetInterleukin-1 receptor-associated kinase 4(Homo sapiens (Human))
Pfizer
Curated by ChEMBL
LigandPNGBDBM50239504(CHEMBL4061890 | US10329302, Example 262 | US107935...)
Affinity DataIC50:  4.70nM. Assay description: Protocol B: To begin the assay, 45 μL of reaction mixture containing 20 mM HEPES pH=7.5, 5 mM MgCl2, 0.0025% Brij-35, 600 μM ATP, 228 μ...
In DepthDetails US Patent
TargetInterleukin-1 receptor-associated kinase 4(Homo sapiens (Human))
Pfizer
Curated by ChEMBL
LigandPNGBDBM50239504(CHEMBL4061890 | US10329302, Example 262 | US107935...)
Affinity DataIC50:  4.70nM. Assay description: This is an in vitro assay to measure IRAK4 enzymatic activity utilizing the DELFIA (Dissociation-Enhanced Lanthanide Fluorescent Immunoassay, Perkin-...
In DepthDetails US Patent