BDBM50239645 CHEMBL4090164
SMILES CC(C)c1cc(cc(c1)C1(C(C)C)c2c(C)[nH]nc2OC(N)=C1C#N)-c1ccc(Cl)s1
InChI Key InChIKey=HTEODOOZCLPUPS-UHFFFAOYSA-N
Data  1 IC50
  Tab Delimited (TSV)   2D SDfile   Computed 3D by Vconf -m prep SDfile
Find this compound or compounds like it in BindingDB:
Activity Spreadsheet -- Enzyme Inhibition Constant Data from BindingDB
Found 1 hit for monomerid = 50239645
TargetGlycine hydroxymethyltransferase(Plasmodium falciparum)
Eth Zurich
Curated by ChEMBL
LigandPNGBDBM50239645(CHEMBL4090164)
Affinity DataIC50:  4.51E+3nM. Assay description: Inhibition of Plasmodium falciparum SHMT using L-serine/(6S)-THF as substrate by methylene tetrahydrofolate dehydrogenase coupled enzyme assay
In DepthDetails ArticlePubMed