BDBM50239693 CHEMBL4063525
SMILES CCCCN(CCCC)C(=O)CC[C@H]1NC(=O)c2cc(Oc3cccc(c3)N(C)C)c(NC(=O)COCc3ccccc3)cc2NC1=O
InChI Key InChIKey=BZRLHYRRPVWAPY-SSEXGKCCSA-N
Data  2 IC50
  Tab Delimited (TSV)   2D SDfile   Computed 3D by Vconf -m prep SDfile
Find this compound or compounds like it in BindingDB:
Activity Spreadsheet -- Enzyme Inhibition Constant Data from BindingDB
Found 2 hits for monomerid = 50239693
TargetNucleotide-binding oligomerization domain-containing protein 1(Homo sapiens (Human))
Chinese Academy Of Medical Sciences And Peking Union Medical College
Curated by ChEMBL
LigandPNGBDBM50239693(CHEMBL4063525)
Affinity DataIC50:  1.30E+3nM. Assay description: Antagonist activity at human NOD1 expressed in HEK-blue cells assessed as inhibition of C12-iE-DAP-stimulated cell activation preincubated for 3 hrs ...
In DepthDetails ArticlePubMed
TargetNucleotide-binding oligomerization domain-containing protein 2(Homo sapiens (Human))
Chinese Academy Of Medical Sciences And Peking Union Medical College
Curated by ChEMBL
LigandPNGBDBM50239693(CHEMBL4063525)
Affinity DataIC50:  1.32E+3nM. Assay description: Antagonist activity at human NOD2 expressed in HEK-Blue cells assessed as inhibition of MDP-stimulated cell activation preincubated for 3 hrs followe...
In DepthDetails ArticlePubMed