BDBM50240038 CHEMBL4067821
SMILES Cc1ccc(OC(C)(C)[C@H]2OC[C@@H](C\C=C/CCC(O)=O)[C@H](O2)c2cccnc2)c(c1)C#N
InChI Key InChIKey=ZFOIWGFSCMNLFS-LDQXDPCPSA-N
Data  1 IC50
  Tab Delimited (TSV)   2D SDfile   Computed 3D by Vconf -m prep SDfile
Find this compound or compounds like it in BindingDB:
Activity Spreadsheet -- Enzyme Inhibition Constant Data from BindingDB
Found 1 hit for monomerid = 50240038
TargetBile salt export pump(Homo sapiens (Human))
Astrazeneca
Curated by ChEMBL
LigandPNGBDBM50240038(CHEMBL4067821)
Affinity DataIC50: <1.00E+4nM. Assay description: Inhibition of human BSEP expressed in baculovirus transfected fall armyworm Sf21 cell membranes vesicles assessed as reduction in ATP-dependent [3H]-...
In DepthDetails ArticlePubMed