BDBM50240055 CHEMBL4096888
SMILES CC(=O)Oc1c(C)cc(Nc2ccn(n2)-c2ccccc2)cc1C
InChI Key InChIKey=XCQWBTDXTTYPDL-UHFFFAOYSA-N
Data  1 IC50
  Tab Delimited (TSV)   2D SDfile   Computed 3D by Vconf -m prep SDfile
Find this compound or compounds like it in BindingDB:
Activity Spreadsheet -- Enzyme Inhibition Constant Data from BindingDB
Found 1 hit for monomerid = 50240055
TargetBile salt export pump(Homo sapiens (Human))
Astrazeneca
Curated by ChEMBL
LigandPNGBDBM50240055(CHEMBL4096888)
Affinity DataIC50: <1.00E+4nM. Assay description: Inhibition of human BSEP expressed in baculovirus transfected fall armyworm Sf21 cell membranes vesicles assessed as reduction in ATP-dependent [3H]-...
In DepthDetails ArticlePubMed