BDBM50240888 CHEMBL4094256
SMILES Clc1cccc(COc2cc(=O)n3[C@@H](Cc4ccccc4)COCc3n2)c1
InChI Key InChIKey=QUBUQCRKGCPSRB-SFHVURJKSA-N
Data  1 KI  1 IC50
  Tab Delimited (TSV)   2D SDfile   Computed 3D by Vconf -m prep SDfile
Find this compound or compounds like it in BindingDB:
Activity Spreadsheet -- Enzyme Inhibition Constant Data from BindingDB
Found 2 hits for monomerid = 50240888
TargetMetabotropic glutamate receptor 5(Homo sapiens (Human))
Pfizer
Curated by ChEMBL
LigandPNGBDBM50240888(CHEMBL4094256)
Affinity DataKi:  3nM. Assay description: Displacement of [3H]MPEPy from human mGlu5 expressed in HEK293FT cell membranes after 1 hr by liquid scintillation counting
In DepthDetails ArticlePubMed
TargetMetabotropic glutamate receptor 5(Rattus norvegicus (Rat))
Pfizer
Curated by ChEMBL
LigandPNGBDBM50240888(CHEMBL4094256)
Affinity DataIC50:  1.10nM. Assay description: Negative allosteric modulation of rat mGlu5 expressed in HEK293 cells assessed as inhibition of glutamate-induced intracellular calcium accumulation ...
In DepthDetails ArticlePubMed