BDBM50241194 (1S,2R)-2-(aminomethyl)cyclopropanecarboxylic acid::(1S,2R)-2-aminomethyl-cyclopropanecarboxylic acid::CHEMBL230115
SMILES NC[C@@H]1C[C@@H]1C(O)=O
InChI Key InChIKey=QUFMERRXRMSAPZ-IMJSIDKUSA-N
Data  1 IC50  1 EC50
  Tab Delimited (TSV)   2D SDfile   Computed 3D by Vconf -m prep SDfile
Find this compound or compounds like it in BindingDB:
Activity Spreadsheet -- Enzyme Inhibition Constant Data from BindingDB
Found 2 hits for monomerid = 50241194
TargetGamma-aminobutyric acid receptor subunit rho-1(Homo sapiens (Human))
The University Of Sydney
Curated by ChEMBL
LigandPNGBDBM50241194((1S,2R)-2-(aminomethyl)cyclopropanecarboxylic acid...)
Affinity DataEC50:  3.97E+4nM. Assay description: Agonist activity at GABAC rho1 receptor (unknown origin)
In DepthDetails ArticlePubMed
TargetGamma-aminobutyric acid receptor subunit rho-1(Homo sapiens (Human))
The University Of Sydney
Curated by ChEMBL
LigandPNGBDBM50241194((1S,2R)-2-(aminomethyl)cyclopropanecarboxylic acid...)
Affinity DataIC50: >8.00E+5nM. Assay description: Antagonist activity at human GABAc Rho1 receptor expressed in Xenopus oocytes assessed as whole cell current production by two electrode voltage clam...
In DepthDetails ArticlePubMed