BDBM50242672 CHEMBL4071225
SMILES Oc1cccc(c1)C1CC2CCC(C1)N2CCCc1ccccc1
InChI Key InChIKey=AKHZTZTXFUYYJF-UHFFFAOYSA-N
Data  2 KI
  Tab Delimited (TSV)   2D SDfile   Computed 3D by Vconf -m prep SDfile
Find this compound or compounds like it in BindingDB:
Activity Spreadsheet -- Enzyme Inhibition Constant Data from BindingDB
Found 2 hits for monomerid = 50242672
TargetMu-type opioid receptor(Homo sapiens (Human))
Theravance Biopharma Us
Curated by ChEMBL
LigandPNGBDBM50242672(CHEMBL4071225)
Affinity DataKi:  0.158nM. Assay description: Displacement of [3H]DPN from recombinant human mu opioid receptor expressed in CHOK1 cell membranes
In DepthDetails ArticlePubMed
TargetDelta-type opioid receptor(Homo sapiens (Human))
Theravance Biopharma Us
Curated by ChEMBL
LigandPNGBDBM50242672(CHEMBL4071225)
Affinity DataKi:  1.30nM. Assay description: Displacement of [3H]DPN from recombinant human delta opioid receptor expressed in CHOK1 cell membranes
In DepthDetails ArticlePubMed