BDBM50242678 CHEMBL4062483
SMILES [H][C@@]12CC[C@]([H])(CC(C1)c1cccc(c1)C(N)=O)N2CCCOc1ccccc1
InChI Key InChIKey=DPRBBEOCXKSIHY-NHCUHLMSSA-N
Data  6 KI
  Tab Delimited (TSV)   2D SDfile   Computed 3D by Vconf -m prep SDfile
Find this compound or compounds like it in BindingDB:
Activity Spreadsheet -- Enzyme Inhibition Constant Data from BindingDB
Found 6 hits for monomerid = 50242678
TargetMu-type opioid receptor(Homo sapiens (Human))
Theravance Biopharma Us
Curated by ChEMBL
LigandPNGBDBM50242678(CHEMBL4062483)
Affinity DataKi:  0.200nM. Assay description: Displacement of [3H]DPN from recombinant human mu opioid receptor expressed in CHOK1 cell membranes
In DepthDetails ArticlePubMed
TargetMu-type opioid receptor(Homo sapiens (Human))
Theravance Biopharma Us
Curated by ChEMBL
LigandPNGBDBM50242678(CHEMBL4062483)
Affinity DataKi:  0.200nM. Assay description: Displacement of [3H]DPN from recombinant human mu opioid receptor expressed in CHOK1 cell membranes
In DepthDetails ArticlePubMed
TargetKappa-type opioid receptor(Cavia porcellus (domestic guinea pig))
Theravance Biopharma Us
Curated by ChEMBL
LigandPNGBDBM50242678(CHEMBL4062483)
Affinity DataKi:  0.794nM. Assay description: Displacement of [3H]DPN from guinea pig kappa opioid receptor expressed in CHOK1 cell membranes
In DepthDetails ArticlePubMed
TargetKappa-type opioid receptor(Cavia porcellus (domestic guinea pig))
Theravance Biopharma Us
Curated by ChEMBL
LigandPNGBDBM50242678(CHEMBL4062483)
Affinity DataKi:  0.794nM. Assay description: Displacement of [3H]DPN from guinea pig kappa opioid receptor expressed in CHOK1 cell membranes
In DepthDetails ArticlePubMed
TargetDelta-type opioid receptor(Homo sapiens (Human))
Theravance Biopharma Us
Curated by ChEMBL
LigandPNGBDBM50242678(CHEMBL4062483)
Affinity DataKi:  3.98nM. Assay description: Displacement of [3H]DPN from recombinant human delta opioid receptor expressed in CHOK1 cell membranes
In DepthDetails ArticlePubMed
TargetDelta-type opioid receptor(Homo sapiens (Human))
Theravance Biopharma Us
Curated by ChEMBL
LigandPNGBDBM50242678(CHEMBL4062483)
Affinity DataKi:  4nM. Assay description: Displacement of [3H]DPN from recombinant human delta opioid receptor expressed in CHOK1 cell membranes
In DepthDetails ArticlePubMed