BDBM50243666 (+/-)-1-(5-(3-(2-(diethylamino)ethoxy)phenyl)-3-(piperidin-3-ylcarbamoyl)thiophen-2-yl)urea::CHEMBL471549
SMILES CCN(CC)CCOc1cccc(c1)-c1cc(C(=O)NC2CCCNC2)c(NC(N)=O)s1
InChI Key InChIKey=VQZOFFVCEALYHF-UHFFFAOYSA-N
Data  2 IC50
  Tab Delimited (TSV)   2D SDfile   Computed 3D by Vconf -m prep SDfile
Find this compound or compounds like it in BindingDB:
Activity Spreadsheet -- Enzyme Inhibition Constant Data from BindingDB
Found 2 hits for monomerid = 50243666
TargetCyclin-dependent kinase 2-associated protein 1(Homo sapiens (Human))
Astrazeneca R&D Boston
Curated by ChEMBL
LigandPNGBDBM50243666((+/-)-1-(5-(3-(2-(diethylamino)ethoxy)phenyl)-3-(p...)
Affinity DataIC50:  2.70E+4nM. Assay description: Inhibition of Cdk1
In DepthDetails ArticlePubMed
TargetSerine/threonine-protein kinase Chk1(Homo sapiens (Human))
Astrazeneca R&D Boston
Curated by ChEMBL
LigandPNGBDBM50243666((+/-)-1-(5-(3-(2-(diethylamino)ethoxy)phenyl)-3-(p...)
Affinity DataIC50:  10nM. Assay description: Inhibition of Chk1
In DepthDetails ArticlePubMed