BDBM50244723 2-chloro-5-[(3,5-dimethylbenzoyl)amino]-N-pyridin-3-ylbenzamide::CHEMBL459470
SMILES Cc1cc(C)cc(c1)C(=O)Nc1ccc(Cl)c(c1)C(=O)Nc1cccnc1
InChI Key InChIKey=FMFYUFUEHMPOMP-UHFFFAOYSA-N
Data  1 IC50
  Tab Delimited (TSV)   2D SDfile   Computed 3D by Vconf -m prep SDfile
Find this compound or compounds like it in BindingDB:
Activity Spreadsheet -- Enzyme Inhibition Constant Data from BindingDB
Found 1 hit for monomerid = 50244723
TargetMacrophage colony-stimulating factor 1 receptor(Homo sapiens (Human))
Astrazeneca R&D Boston
Curated by ChEMBL
LigandPNGBDBM50244723(2-chloro-5-[(3,5-dimethylbenzoyl)amino]-N-pyridin-...)
Affinity DataIC50:  8nM. Assay description: Inhibition of CSF1R (unknown origin)
In DepthDetails ArticlePubMed