BDBM50244783 2-chloro-5-[(3,5-dimethylbenzoyl)amino]-N-1,3-thiazol-5-ylbenzamide::CHEMBL461573
SMILES Cc1cc(C)cc(c1)C(=O)Nc1ccc(Cl)c(c1)C(=O)Nc1cncs1
InChI Key InChIKey=ZLFBFXIWLVCQQD-UHFFFAOYSA-N
Data  1 IC50
  Tab Delimited (TSV)   2D SDfile   Computed 3D by Vconf -m prep SDfile
Find this compound or compounds like it in BindingDB:
Activity Spreadsheet -- Enzyme Inhibition Constant Data from BindingDB
Found 1 hit for monomerid = 50244783
TargetMacrophage colony-stimulating factor 1 receptor(Homo sapiens (Human))
Astrazeneca R&D Boston
Curated by ChEMBL
LigandPNGBDBM50244783(2-chloro-5-[(3,5-dimethylbenzoyl)amino]-N-1,3-thia...)
Affinity DataIC50:  3nM. Assay description: Inhibition of CSF1R (unknown origin)
In DepthDetails ArticlePubMed