BDBM50246078 CHEMBL4073158
SMILES CC(C)C[C@H](NC(=O)[C@H](CC(O)=O)NC(=O)[C@H](CC(C)C)NC(=O)[C@]1(C)CCCCCCCCCCCC[C@](C)(NC(=O)CNC(=O)[C@H](CCC(N)=O)NC(=O)COCCOCCNC(=S)Nc2ccc3c(c2)C(=O)OC32c3ccc(O)cc3Oc3cc(O)ccc23)C(=O)N[C@@H](CC(C)C)C(=O)N[C@@H](CCC(N)=O)C(=O)N1)C(=O)N[C@@H](C)C(=O)N[C@@H](CO)C(N)=O
InChI Key InChIKey=MVDHHVDFVGYLHO-JKFUYOIKSA-N
Data  1 Kd
  Tab Delimited (TSV)   2D SDfile   Computed 3D by Vconf -m prep SDfile
Find this compound or compounds like it in BindingDB:
Activity Spreadsheet -- Enzyme Inhibition Constant Data from BindingDB
Found 1 hit for monomerid = 50246078
Target14-3-3 protein zeta/delta(Homo sapiens)
Chemical Genomics Centre Of The Max Planck Society
Curated by ChEMBL
LigandPNGBDBM50246078(CHEMBL4073158)
Affinity DataKd:  510nM. Assay description: Binding affinity to 14-3-3zeta (1 to 230 residues) (unknown origin) after 1 hr using FITC labeled compound by fluorescence polarization assay
In DepthDetails ArticlePubMed