BDBM50246559 CHEMBL4059560
SMILES [I-].COc1ccc(CN(CC(=O)NCc2ccccc2)C(=O)CCCCCn2cc[n+](C)c2\C=N/O)cc1
InChI Key InChIKey=WDPCSKDJISDELW-UHFFFAOYSA-O
Data  1 IC50  4 Kd
  Tab Delimited (TSV)   2D SDfile   Computed 3D by Vconf -m prep SDfile
Find this compound or compounds like it in BindingDB:
Activity Spreadsheet -- Enzyme Inhibition Constant Data from BindingDB
Found 5 hits for monomerid = 50246559
TargetAcetylcholinesterase(Homo sapiens (Human))
Tno
Curated by ChEMBL
LigandPNGBDBM50246559(CHEMBL4059560)
Affinity DataKd:  1.70E+4nM. Assay description: Reactivation of tabun inhibited human erythrocyte AChE using acetylthiocholine iodide as substrate preincubated up to 60 mins followed by substrate a...
In DepthDetails ArticlePubMed
TargetAcetylcholinesterase(Homo sapiens (Human))
Tno
Curated by ChEMBL
LigandPNGBDBM50246559(CHEMBL4059560)
Affinity DataKd:  5.20E+4nM. Assay description: Reactivation of VX inhibited human erythrocyte AChE using acetylthiocholine iodide as substrate preincubated up to 60 mins followed by substrate addi...
In DepthDetails ArticlePubMed
TargetAcetylcholinesterase(Homo sapiens (Human))
Tno
Curated by ChEMBL
LigandPNGBDBM50246559(CHEMBL4059560)
Affinity DataKd:  2.90E+4nM. Assay description: Reactivation of sarin inhibited human erythrocyte AChE using acetylthiocholine iodide as substrate preincubated up to 60 mins followed by substrate a...
In DepthDetails ArticlePubMed
TargetAcetylcholinesterase(Homo sapiens (Human))
Tno
Curated by ChEMBL
LigandPNGBDBM50246559(CHEMBL4059560)
Affinity DataKd:  3.54E+4nM. Assay description: Reactivation of cyclosarin inhibited human erythrocyte AChE using acetylthiocholine iodide as substrate preincubated up to 60 mins followed by substr...
In DepthDetails ArticlePubMed
TargetAcetylcholinesterase(Homo sapiens (Human))
Tno
Curated by ChEMBL
LigandPNGBDBM50246559(CHEMBL4059560)
Affinity DataIC50: >1.00E+6nM. Assay description: Reactivation of organophosphate inhibited human erythrocyte AChE assessed as organophosphate IC50 using acetylthiocholine iodide as substrate preincu...
In DepthDetails ArticlePubMed