BDBM50247114 CHEMBL4086127
SMILES C[C@@H](COc1cnc(o1)-c1ccc(Oc2cccc(OCC3CC3)c2)nc1)NC(C)=O
InChI Key InChIKey=WVQMYHSGPKOODW-HNNXBMFYSA-N
Data  3 IC50
  Tab Delimited (TSV)   2D SDfile   Computed 3D by Vconf -m prep SDfile
Find this compound or compounds like it in BindingDB:
Activity Spreadsheet -- Enzyme Inhibition Constant Data from BindingDB
Found 3 hits for monomerid = 50247114
TargetAcetyl-CoA carboxylase 1(Homo sapiens (Human))
Takeda Pharmaceutical
Curated by ChEMBL
LigandPNGBDBM50247114(CHEMBL4086127)
Affinity DataIC50:  0.960nM. Assay description: Inhibition of recombinant human ACC1 expressed in SF-9 cells preincubated for 60 mins followed by addition of substrate solution containing acetyl-Co...
In DepthDetails ArticlePubMed
TargetAcetyl-CoA carboxylase 1(Homo sapiens (Human))
Takeda Pharmaceutical
Curated by ChEMBL
LigandPNGBDBM50247114(CHEMBL4086127)
Affinity DataIC50:  2.80nM. Assay description: Inhibition of ACC1 in human HCT116 cells assessed as reduction of [14C]acetate uptake preincubated for 60 mins followed by addition of [14C]acetate a...
In DepthDetails ArticlePubMed
TargetAcetyl-CoA carboxylase 2(Homo sapiens (Human))
Takeda Pharmaceutical
Curated by ChEMBL
LigandPNGBDBM50247114(CHEMBL4086127)
Affinity DataIC50:  290nM. Assay description: Inhibition of recombinant human ACC2 expressed in SF-9 cells preincubated for 60 mins followed by addition of substrate solution containing acetyl-Co...
In DepthDetails ArticlePubMed