BDBM50247261 5-(3,5-dimethoxyphenyl)-N-(4-fluorobenzo[d]thiazol-2-yl)-1,3,4-oxadiazol-2-amine::CHEMBL473314::cid_3240046
SMILES COc1cc(OC)cc(c1)-c1nnc(Nc2nc3c(F)cccc3s2)o1
InChI Key InChIKey=DIPCWZOATLQURP-UHFFFAOYSA-N
Data  7 IC50  1 EC50
  Tab Delimited (TSV)   2D SDfile   Computed 3D by Vconf -m prep SDfile
Find this compound or compounds like it in BindingDB:
Activity Spreadsheet -- Enzyme Inhibition Constant Data from BindingDB
Found 8 hits for monomerid = 50247261
TargetCollagenase 3(Homo sapiens (Human))
The Scripps Research Institute Molecular Screening Center
Curated by PubChem BioAssay
LigandPNGBDBM50247261(5-(3,5-dimethoxyphenyl)-N-(4-fluorobenzo[d]thiazol...)
Affinity DataIC50:  3.52E+3nM. Assay description: External Assay ID: MMP13_INH_deltaRFU_ 1536_IC50 Source (MLSCN Center Name): The Scripps Research Institute Molecular Screening Center Center Affilia...
In DepthDetails PCBioAssay
TargetATP-dependent molecular chaperone HSP82(Candida albicans)
Broad Institute
Curated by PubChem BioAssay
LigandPNGBDBM50247261(5-(3,5-dimethoxyphenyl)-N-(4-fluorobenzo[d]thiazol...)
Affinity DataEC50: >1.50E+5nM. Assay description: Broad Institute: Reversing Antifungal Drug Resistance Project ID: 2037 Keywords: Candida albicans, drug resistance, Fluconazole, Hsp90, Calcineurin, ...
In DepthDetails PCBioAssay
TargetCysteine protease ATG4B(Homo sapiens (Human))
Burnham Center For Chemical Genomics
Curated by PubChem BioAssay
LigandPNGBDBM50247261(5-(3,5-dimethoxyphenyl)-N-(4-fluorobenzo[d]thiazol...)
Affinity DataIC50:  5.68E+3nM. Assay description: Data Source: Sanford-Burnham Center for Chemical Genomics (SBCCG) Source Affiliation: Sanford-Burnham Medical Research Institute (SBMRI, San Diego, C...
In DepthDetails PCBioAssay
TargetCollagenase 3(Homo sapiens (Human))
The Scripps Research Institute Molecular Screening Center
Curated by PubChem BioAssay
LigandPNGBDBM50247261(5-(3,5-dimethoxyphenyl)-N-(4-fluorobenzo[d]thiazol...)
Affinity DataIC50:  3.50E+3nM. Assay description: Inhibition of human recombinant MMP13 expressed in Escherichia coli
In DepthDetails ArticlePubMed
TargetProthrombin(Bos taurus (Bovine))
Burnham Center For Chemical Genomics
Curated by PubChem BioAssay
LigandPNGBDBM50247261(5-(3,5-dimethoxyphenyl)-N-(4-fluorobenzo[d]thiazol...)
Affinity DataIC50:  6.28E+4nM. Assay description: Data Source: Sanford-Burnham Center for Chemical Genomics (SBCCG) Source Affiliation: Sanford Burnham Medical Research Institute (SBMRI, La Jolla, CA...
In DepthDetails PCBioAssay
Target26S proteasome non-ATPase regulatory subunit 14(Homo sapiens (Human))
Burnham Center For Chemical Genomics
Curated by PubChem BioAssay
LigandPNGBDBM50247261(5-(3,5-dimethoxyphenyl)-N-(4-fluorobenzo[d]thiazol...)
Affinity DataIC50:  3.01E+4nM. Assay description: Data Source: Sanford-Burnham Center for Chemical Genomics (SBCCG) Source Affiliation: Sanford Burnham Medical Research Institute (SBMRI, La Jolla, CA...
In DepthDetails PCBioAssay
TargetEndothelial PAS domain-containing protein 1(Homo sapiens (Human))
Burnham Center For Chemical Genomics
Curated by PubChem BioAssay
LigandPNGBDBM50247261(5-(3,5-dimethoxyphenyl)-N-(4-fluorobenzo[d]thiazol...)
Affinity DataIC50:  3.15E+3nM
In DepthDetails PCBioAssay
TargetPhospholipase A2(Homo sapiens (Human))
Burnham Center For Chemical Genomics
Curated by PubChem BioAssay
LigandPNGBDBM50247261(5-(3,5-dimethoxyphenyl)-N-(4-fluorobenzo[d]thiazol...)
Affinity DataIC50: >8.00E+4nM. Assay description: Data Source: Sanford-Burnham Center for Chemical Genomics (SBCCG) Source Affiliation: Sanford-Burnham Medical Research Institute (SBMRI, San Diego, C...
In DepthDetails PCBioAssay